{"text_format":"1","workbook":"xlsx","n_sheets":2,"sheets":["PROGRAMA","CALCULOS"],"not_rendered":{"charts":0,"images":0,"macros":1,"external_links":0,"defined_names":5,"comments":1,"pivot_tables":0},"unopened":[],"bounds":{"document_bytes":16777216,"sheet_cells":100000,"rows_first":2000,"rows_last":500,"rows_between":2000,"halvings":0,"cell_chars":16384,"cell_head_chars":4096},"cells_cut":0,"cells_raw":0,"read":"whole","date_system":"1900"}

{"sheet":"PROGRAMA","index":0,"n_rows":163,"n_cols":21,"rows_kept":163,"cut":false,"hidden":false,"merged":[[3,0,3,11],[4,0,6,0],[4,11,6,11],[3,18,3,20]]}
["AGENTE ",null,"FECHA ",null,null,null,null,null,null,null,null,null,null,"ACP"]
[null,null,null,null,null,null,null,null,null,null,null,null,null,"AES"]
[null,null,null,null,null,null,null,null,null,null,null,null,null,"AES-CHANG"]
["PROGRAMAS PRELIMINARES IMPORTACION ( MW) (EMPRESA CONTRAPARTE)",null,null,null,null,null,null,null,null,null,null,null,null,"ALTOVALLE",null,null,null,"PAISES","VALORES DE BUSQUEDA"]
["HORA\nCENTROAMERICANA",null,null,null,null,null,null,null,null,null,null,"TOTAL\nMW",null,"ANSA","AMATEX","CNFFF",{"$f":"TODAY()-360","v":"2022-07-23"},"COSTA RICA","COSTARICA","COSTARICA","5GICE"]
[null,null,null,null,null,null,null,null,null,null,null,null,null,"CALDERA","AMM","CNFF",{"$f":"TODAY()+360","v":"2024-07-12"},"NICARAGUA","COSTARICA","COSTARICA","5DICE"]
[null,null,null,null,null,null,null,null,null,null,null,null,null,"C-ELETA","C01","CF",null,"HONDURAS","NICARAGUA","NICARAGUA","4DDISNORTE"]
["00:00:00",null,null,null,null,null,null,null,null,null,null,{"$f":"IF(B8+C8+D8+E8+F8+G8+H8+I8+J8+K8>CALCULOS!K4,\"ERROR\",B8+C8+D8+E8+F8+G8+H8+I8+J8+K8)","v":0},null,"CELSIAALT","C02",null,null,"EL SALVADOR","NICARAGUA","NICARAGUA","4DDISSUR"]
["01:00:00",null,null,null,null,null,null,null,null,null,null,{"$f":"IF(B9+C9+D9+E9+F9+G9+H9+I9+J9+K9>CALCULOS!K5,\"ERROR\",B9+C9+D9+E9+F9+G9+H9+I9+J9+K9)","v":0},null,"CELSIABLM","C03",null,null,"GUATEMALA","NICARAGUA","NICARAGUA","4DENELBLUE"]
["02:00:00",null,null,null,null,null,null,null,null,null,null,{"$f":"IF(B10+C10+D10+E10+F10+G10+H10+I10+J10+K10>CALCULOS!K6,\"ERROR\",B10+C10+D10+E10+F10+G10+H10+I10+J10+K10)","v":0},null,"CELSIABON","C06",null,null,null,"NICARAGUA","NICARAGUA","4DENELMULU"]
["03:00:00",null,null,null,null,null,null,null,null,null,null,{"$f":"IF(B11+C11+D11+E11+F11+G11+H11+I11+J11+K11>CALCULOS!K7,\"ERROR\",B11+C11+D11+E11+F11+G11+H11+I11+J11+K11)","v":0},null,"CELSIACENT","C07",null,null,null,"NICARAGUA","NICARAGUA","4DENELSIUN"]
["04:00:00",null,null,null,null,null,null,null,null,null,null,{"$f":"IF(B12+C12+D12+E12+F12+G12+H12+I12+J12+K12>CALCULOS!K8,\"ERROR\",B12+C12+D12+E12+F12+G12+H12+I12+J12+K12)","v":0},null,"CORPISTMO","C08",null,null,null,"NICARAGUA","NICARAGUA","4GAGRICORP"]
["05:00:00",null,null,null,null,null,null,null,null,null,null,{"$f":"IF(B13+C13+D13+E13+F13+G13+H13+I13+J13+K13>CALCULOS!K9,\"ERROR\",B13+C13+D13+E13+F13+G13+H13+I13+J13+K13)","v":0},null,"CSOLAR","C09",null,null,null,"NICARAGUA","NICARAGUA","4GALBANISA"]
["06:00:00",null,null,null,null,null,null,null,null,null,null,{"$f":"IF(B14+C14+D14+E14+F14+G14+H14+I14+J14+K14>CALCULOS!K10,\"ERROR\",B14+C14+D14+E14+F14+G14+H14+I14+J14+K14)","v":0},null,"DACONANSOL","C11",null,null,null,"NICARAGUA","NICARAGUA","4GAMAYO1"]
["07:00:00",null,null,null,null,null,null,null,null,null,null,{"$f":"IF(B15+C15+D15+E15+F15+G15+H15+I15+J15+K15>CALCULOS!K11,\"ERROR\",B15+C15+D15+E15+F15+G15+H15+I15+J15+K15)","v":0},null,"DESHIDCORP","C12",null,null,null,"NICARAGUA","NICARAGUA","4GAMAYO2"]
["08:00:00",null,null,null,null,null,null,null,null,null,null,{"$f":"IF(B16+C16+D16+E16+F16+G16+H16+I16+J16+K16>CALCULOS!K12,\"ERROR\",B16+C16+D16+E16+F16+G16+H16+I16+J16+K16)","v":0},null,"DSOLAR10","C13",null,null,null,"NICARAGUA","NICARAGUA","4GBPOWER"]
["09:00:00",null,null,null,null,null,null,null,null,null,null,{"$f":"IF(B17+C17+D17+E17+F17+G17+H17+I17+J17+K17>CALCULOS!K13,\"ERROR\",B17+C17+D17+E17+F17+G17+H17+I17+J17+K17)","v":0},null,"EGEISTMO","C15",null,null,null,"NICARAGUA","NICARAGUA","4GDISNORTE"]
["10:00:00",null,null,null,null,null,null,null,null,null,null,{"$f":"IF(B18+C18+D18+E18+F18+G18+H18+I18+J18+K18>CALCULOS!K14,\"ERROR\",B18+C18+D18+E18+F18+G18+H18+I18+J18+K18)","v":0},null,"EGESA","C17",null,null,null,"NICARAGUA","NICARAGUA","4GDISSUR"]
["11:00:00",null,null,null,null,null,null,null,null,null,null,{"$f":"IF(B19+C19+D19+E19+F19+G19+H19+I19+J19+K19>CALCULOS!K15,\"ERROR\",B19+C19+D19+E19+F19+G19+H19+I19+J19+K19)","v":0},null,"EISA","C22",null,null,null,"NICARAGUA","NICARAGUA","4GEEC-20"]
["12:00:00",null,null,null,null,null,null,null,null,null,null,{"$f":"IF(B20+C20+D20+E20+F20+G20+H20+I20+J20+K20>CALCULOS!K16,\"ERROR\",B20+C20+D20+E20+F20+G20+H20+I20+J20+K20)","v":0},null,"EMNADESA","C27",null,null,null,"NICARAGUA","NICARAGUA","4GEOLO"]
["13:00:00",null,null,null,null,null,null,null,null,null,null,{"$f":"IF(B21+C21+D21+E21+F21+G21+H21+I21+J21+K21>CALCULOS!K17,\"ERROR\",B21+C21+D21+E21+F21+G21+H21+I21+J21+K21)","v":0},null,"ENELSOLAR","CECSA",null,null,null,"NICARAGUA","NICARAGUA","4GGEOSA"]
["14:00:00",null,null,null,null,null,null,null,null,null,null,{"$f":"IF(B22+C22+D22+E22+F22+G22+H22+I22+J22+K22>CALCULOS!K18,\"ERROR\",B22+C22+D22+E22+F22+G22+H22+I22+J22+K22)","v":0},null,"ESEPSA","CEESA",null,null,null,"NICARAGUA","NICARAGUA","4GHEMCO"]
["15:00:00",null,null,null,null,null,null,null,null,null,null,{"$f":"IF(B23+C23+D23+E23+F23+G23+H23+I23+J23+K23>CALCULOS!K19,\"ERROR\",B23+C23+D23+E23+F23+G23+H23+I23+J23+K23)","v":0},null,"FORTUNA","CET",null,null,null,"NICARAGUA","NICARAGUA","4GMONTEROS"]
["16:00:00",null,null,null,null,null,null,null,null,null,null,{"$f":"IF(B24+C24+D24+E24+F24+G24+H24+I24+J24+K24>CALCULOS!K20,\"ERROR\",B24+C24+D24+E24+F24+G24+H24+I24+J24+K24)","v":0},null,"FOUNTAIN","CNDC",null,null,null,"NICARAGUA","NICARAGUA","4UAGRICORP"]
["17:00:00",null,null,null,null,null,null,null,null,null,null,{"$f":"IF(B25+C25+D25+E25+F25+G25+H25+I25+J25+K25>CALCULOS!K21,\"ERROR\",B25+C25+D25+E25+F25+G25+H25+I25+J25+K25)","v":0},null,"FSOLAR2","COASTAL",null,null,null,"NICARAGUA","NICARAGUA","4UALBANISA"]
["18:00:00",null,null,null,null,null,null,null,null,null,null,{"$f":"IF(B26+C26+D26+E26+F26+G26+H26+I26+J26+K26>CALCULOS!K22,\"ERROR\",B26+C26+D26+E26+F26+G26+H26+I26+J26+K26)","v":0},null,"GANA","COENESA",null,null,null,"NICARAGUA","NICARAGUA","4UAMAYO1"]
["19:00:00",null,null,null,null,null,null,null,null,null,null,{"$f":"IF(B27+C27+D27+E27+F27+G27+H27+I27+J27+K27>CALCULOS!K23,\"ERROR\",B27+C27+D27+E27+F27+G27+H27+I27+J27+K27)","v":0},null,"GENA","COMEGSA",null,null,null,"NICARAGUA","NICARAGUA","4UAMAYO2"]
["20:00:00",null,null,null,null,null,null,null,null,null,null,{"$f":"IF(B28+C28+D28+E28+F28+G28+H28+I28+J28+K28>CALCULOS!K24,\"ERROR\",B28+C28+D28+E28+F28+G28+H28+I28+J28+K28)","v":0},null,"GENISA","CONEC",null,null,null,"NICARAGUA","NICARAGUA","4UBPOWER"]
["21:00:00",null,null,null,null,null,null,null,null,null,null,{"$f":"IF(B29+C29+D29+E29+F29+G29+H29+I29+J29+K29>CALCULOS!K25,\"ERROR\",B29+C29+D29+E29+F29+G29+H29+I29+J29+K29)","v":0},null,"GENPED","D01",null,null,null,"NICARAGUA","NICARAGUA","4UCCN"]
["22:00:00",null,null,null,null,null,null,null,null,null,null,{"$f":"IF(B30+C30+D30+E30+F30+G30+H30+I30+J30+K30>CALCULOS!K26,\"ERROR\",B30+C30+D30+E30+F30+G30+H30+I30+J30+K30)","v":0},null,"GSOLAR","D02",null,null,null,"NICARAGUA","NICARAGUA","4UCHDN"]
["23:00:00",null,null,null,null,null,null,null,null,null,null,{"$f":"IF(B31+C31+D31+E31+F31+G31+H31+I31+J31+K31>CALCULOS!K27,\"ERROR\",B31+C31+D31+E31+F31+G31+H31+I31+J31+K31)","v":0},null,"HBOQUERON","D03",null,null,null,"NICARAGUA","NICARAGUA","4UEEC-20"]
[null,{"$f":"COUNTIF(B5:B7,\"<>\"&\"*\")","v":3},{"$f":"COUNTIF(C5:C7,\"<>\"&\"*\")","v":3},{"$f":"COUNTIF(D5:D7,\"<>\"&\"*\")","v":3},3,3,3,3,3,3,3,null,null,"HBTOTUMA","DISNORTE",null,null,null,"NICARAGUA","NICARAGUA","4UENSA"]
[null,null,null,null,null,null,null,null,null,null,null,null,null,"HCAISAN","DUKE",null,null,null,"NICARAGUA","NICARAGUA","4UEOLO"]
["GUATEMALA","EL SALVADOR","HONDURAS","NICARAGUA","COSTA RICA",null,null,null,null,null,null,null,null,"HIBERICA","ECONOENE",null,null,null,"NICARAGUA","NICARAGUA","4UGEOSA"]
[null,null,null,null,null,null,null,null,null,null,null,null,null,"HIDRO","EEC-20",null,null,null,"NICARAGUA","NICARAGUA","4UHOLCIM"]
["1CCOMCOELC","2C_C03","3GENEE","4DDISNORTE","5GICE",null,null,null,null,null,null,null,null,"HPIEDRA","EEGSA",null,null,null,"NICARAGUA","NICARAGUA","4UMONTEROS"]
["1CCOMCECEE","2C_C06","3DENEE","4DDISSUR","5DICE",null,null,null,null,null,null,null,null,"HTERIBE","ENATREL",null,null,null,"HONDURAS","HONDURAS","3DENEE"]
["1GGENCOEGE","2C_C08",null,"4GEEC-20",null,null,null,null,null,null,null,null,null,"HYDROPOWER","ENEE",null,null,null,"HONDURAS","HONDURAS","3GENEE"]
["1CCOMCOMCO","2C_C11",null,"4UGEOSA",null,null,null,null,null,null,null,null,null,"IDEALPMA","ENEE-HN",null,null,null,"ELSALVADOR","ELSALVADOR","2C_C03"]
["1CCOMCOEND","2C_C15",null,"4UHOLCIM",null,null,null,null,null,null,null,null,null,"JINRO","ENTRESAM",null,null,null,"ELSALVADOR","ELSALVADOR","2C_C05"]
["1TCOMCOELG","2C_C17",null,"4GALBANISA",null,null,null,null,null,null,null,null,null,"KANAN","EPTHON",null,null,null,"ELSALVADOR","ELSALVADOR","2C_C06"]
["1CCOMCOELG","2C_C27",null,"4UALBANISA",null,null,null,null,null,null,null,null,null,"MINERAPMA","EXCELERG",null,null,null,"ELSALVADOR","ELSALVADOR","2C_C07"]
["1CCOMCOMEL","2C_C34",null,"4UBPOWER",null,null,null,null,null,null,null,null,null,"PANAM","G01",null,null,null,"ELSALVADOR","ELSALVADOR","2C_C08"]
["1TCOMCOMEL","2D_D01",null,"4GBPOWER",null,null,null,null,null,null,null,null,null,"PANASOLAR","G02",null,null,null,"ELSALVADOR","ELSALVADOR","2C_C11"]
["1CCOMECONO","2D_D02",null,"4UCCN",null,null,null,null,null,null,null,null,null,"P-ANCHO","G03",null,null,null,"ELSALVADOR","ELSALVADOR","2C_C12"]
["1DDISEEGTN","2D_D03",null,"4UAMAYO1",null,null,null,null,null,null,null,null,null,"PEDREGAL","G05",null,null,null,"ELSALVADOR","ELSALVADOR","2C_C15"]
["1GGENCONCE","2G_G02",null,"4GAMAYO1",null,null,null,null,null,null,null,null,null,"PERLANORT","G06",null,null,null,"ELSALVADOR","ELSALVADOR","2C_C17"]
["1UGUSDUEGC","2G_G05",null,"4UAMAYO2",null,null,null,null,null,null,null,null,null,"PERLASUR","GDUKE",null,null,null,"ELSALVADOR","ELSALVADOR","2C_C27"]
["1GGENDUEGC","2C_C32",null,"4GAMAYO2",null,null,null,null,null,null,null,null,null,"PSOLAR2","GECSA",null,null,null,"ELSALVADOR","ELSALVADOR","2C_C31"]
["1GGENGEELC","2C_C07",null,"4UAGRICORP",null,null,null,null,null,null,null,null,null,"PSZ1","GECSAGUA",null,null,null,"ELSALVADOR","ELSALVADOR","2C_C32"]
["1GGENHIXAC","2C_C12",null,"4GAGRICORP",null,null,null,null,null,null,null,null,null,"RCHICO","GENINTEL",null,null,null,"ELSALVADOR","ELSALVADOR","2C_C33"]
["1GGENGEELN","2C_C31",null,"4UENSA",null,null,null,null,null,null,null,null,null,"SAZUEROVEN","GENOR",null,null,null,"ELSALVADOR","ELSALVADOR","2C_C34"]
["1GGENINGMA","2C_C05",null,"4UEEC-20",null,null,null,null,null,null,null,null,null,"SCOCLEVEN","GEOSA",null,null,null,"ELSALVADOR","ELSALVADOR","2C_C35"]
["1TGENINGMA","2D_D04",null,"4UEOLO",null,null,null,null,null,null,null,null,null,"SFRAN","GLOBELEQ",null,null,null,"ELSALVADOR","ELSALVADOR","2C_C44"]
["1CCOMPOLIW","2D_D05",null,"4GEOLO",null,null,null,null,null,null,null,null,null,"SLORENZO","HIDROGES",null,null,null,"ELSALVADOR","ELSALVADOR","2C_C45"]
["1CCOMMAYEL","2D_D08",null,"4GGEOSA",null,null,null,null,null,null,null,null,null,"SPMAVEN","HOLCIM",null,null,null,"ELSALVADOR","ELSALVADOR","2C_C51"]
["1GGENINVAT","2C_C35",null,"4GMONTEROS",null,null,null,null,null,null,null,null,null,"TECNISOL1","ICE",null,null,null,"ELSALVADOR","ELSALVADOR","2C_C53"]
["1GGENPANTA","2C_C33",null,"4UMONTEROS",null,null,null,null,null,null,null,null,null,"TECNISOL2","ICE-OM",null,null,null,"ELSALVADOR","ELSALVADOR","2C_C55"]
["1CCOMRECGE",null,null,"4UCHDN",null,null,null,null,null,null,null,null,null,"TECNISOL3","POLIWATT",null,null,null,"ELSALVADOR","ELSALVADOR","2C_C59"]
["1TGENINGSD",null,null,"4GHEMCO",null,null,null,null,null,null,null,null,null,"TECNISOL4","SANTAANA",null,null,null,"ELSALVADOR","ELSALVADOR","2C_C63"]
["1GGENINGSD",null,null,null,null,null,null,null,null,null,null,null,null,"TROPITER","UT-SV",null,null,null,"ELSALVADOR","ELSALVADOR","2C_C65"]
["1GGENTACAE",null,null,null,null,null,null,null,null,null,null,null,null,"UCETESA",null,null,null,null,"ELSALVADOR","ELSALVADOR","2D_D01"]
["1GGENTECNO",null,null,null,null,null,null,null,null,null,null,null,null,"UEPPME2",null,null,null,null,"ELSALVADOR","ELSALVADOR","2D_D02"]
["1CCOMBRENC",null,null,null,null,null,null,null,null,null,null,null,null,null,null,null,null,null,"ELSALVADOR","ELSALVADOR","2D_D03"]
["1UGUSCARPR",null,null,null,null,null,null,null,null,null,null,null,null,null,null,null,null,null,"ELSALVADOR","ELSALVADOR","2D_D04"]
["1GGENCGESJ",null,null,null,null,null,null,null,null,null,null,null,null,null,null,null,null,null,"ELSALVADOR","ELSALVADOR","2D_D05"]
["1CCOMCOELP",null,null,null,null,null,null,null,null,null,null,null,null,null,null,null,null,null,"ELSALVADOR","ELSALVADOR","2D_D08"]
[null,null,null,null,null,null,null,null,null,null,null,null,null,null,null,null,null,null,"ELSALVADOR","ELSALVADOR","2G_C24"]
[null,null,null,null,null,null,null,null,null,null,null,null,null,null,null,null,null,null,"ELSALVADOR","ELSALVADOR","2G_G02"]
["1GGENCOELL",null,null,null,null,null,null,null,null,null,null,null,null,null,null,null,null,null,"ELSALVADOR","ELSALVADOR","2G_G05"]
["1CCOMCONEL",null,null,null,null,null,null,null,null,null,null,null,null,null,null,null,null,null,"GUATEMALA","GUATEMALA","1CCOMBORAX"]
["1DDISDEOCT",null,null,null,null,null,null,null,null,null,null,null,null,null,null,null,null,null,"GUATEMALA","GUATEMALA","1CCOMBRENC"]
["1DDISDEORT",null,null,null,null,null,null,null,null,null,null,null,null,null,null,null,null,null,"GUATEMALA","GUATEMALA","1CCOMCECEE"]
["1GGENPILAR",null,null,null,null,null,null,null,null,null,null,null,null,null,null,null,null,null,"GUATEMALA","GUATEMALA","1CCOMCOELC"]
["1UGUSEPSTC",null,null,null,null,null,null,null,null,null,null,null,null,null,null,null,null,null,"GUATEMALA","GUATEMALA","1CCOMCOELG"]
["1UGUSFRG01",null,null,null,null,null,null,null,null,null,null,null,null,null,null,null,null,null,"GUATEMALA","GUATEMALA","1CCOMCOELP"]
["1UGUSFRG09",null,null,null,null,null,null,null,null,null,null,null,null,null,null,null,null,null,"GUATEMALA","GUATEMALA","1CCOMCOEND"]
["1UGUSFRG11",null,null,null,null,null,null,null,null,null,null,null,null,null,null,null,null,null,"GUATEMALA","GUATEMALA","1CCOMCOGUE"]
["1UGUSGALRE",null,null,null,null,null,null,null,null,null,null,null,null,null,null,null,null,null,"GUATEMALA","GUATEMALA","1CCOMCOMCO"]
["1GGENGENES",null,null,null,null,null,null,null,null,null,null,null,null,null,null,null,null,null,"GUATEMALA","GUATEMALA","1CCOMCOMEL"]
["1GGDRHIDSD",null,null,null,null,null,null,null,null,null,null,null,null,null,null,null,null,null,"GUATEMALA","GUATEMALA","1CCOMCONEL"]
["1UGUSIRTRA",null,null,null,null,null,null,null,null,null,null,null,null,null,null,null,null,null,"GUATEMALA","GUATEMALA","1CCOMCUCOE"]
["1UGUSPAFDG",null,null,null,null,null,null,null,null,null,null,null,null,null,null,null,null,null,"GUATEMALA","GUATEMALA","1CCOMECONO"]
["1GGENPUQPL",null,null,null,null,null,null,null,null,null,null,null,null,null,null,null,null,null,"GUATEMALA","GUATEMALA","1CCOMEDECS"]
["1UGUSRAEMI",null,null,null,null,null,null,null,null,null,null,null,null,null,null,null,null,null,"GUATEMALA","GUATEMALA","1CCOMELPOM"]
["1GGENRENAC",null,null,null,null,null,null,null,null,null,null,null,null,null,null,null,null,null,"GUATEMALA","GUATEMALA","1CCOMENEGU"]
["1TGENSIDGU",null,null,null,null,null,null,null,null,null,null,null,null,null,null,null,null,null,"GUATEMALA","GUATEMALA","1CCOMENGPG"]
["1GGENSIDGU",null,null,null,null,null,null,null,null,null,null,null,null,null,null,null,null,null,"GUATEMALA","GUATEMALA","1CCOMGEOEN"]
["1UGUSTIWSG",null,null,null,null,null,null,null,null,null,null,null,null,null,null,null,null,null,"GUATEMALA","GUATEMALA","1CCOMIONEN"]
["1UGUSACUAM",null,null,null,null,null,null,null,null,null,null,null,null,null,null,null,null,null,"GUATEMALA","GUATEMALA","1CCOMMAYEL"]
[null,null,null,null,null,null,null,null,null,null,null,null,null,null,null,null,null,null,"GUATEMALA","GUATEMALA","1CCOMMERGU"]
["1UGUSAGJIC",null,null,null,null,null,null,null,null,null,null,null,null,null,null,null,null,null,"GUATEMALA","GUATEMALA","1CCOMPOLIW"]
["1UGUSALISL",null,null,null,null,null,null,null,null,null,null,null,null,null,null,null,null,null,"GUATEMALA","GUATEMALA","1CCOMRECGE"]
["1CCOMCOGUE",null,null,null,null,null,null,null,null,null,null,null,null,null,null,null,null,null,"GUATEMALA","GUATEMALA","1CCOMSOLGU"]
["1DDISDEOCN",null,null,null,null,null,null,null,null,null,null,null,null,null,null,null,null,null,"GUATEMALA","GUATEMALA","1CCOMVIELG"]
["1UGUSFRG07",null,null,null,null,null,null,null,null,null,null,null,null,null,null,null,null,null,"GUATEMALA","GUATEMALA","1CCOMWATTS"]
["1UGUSGAMTE",null,null,null,null,null,null,null,null,null,null,null,null,null,null,null,null,null,"GUATEMALA","GUATEMALA","1DDISDEOCN"]
["1CCOMGEOEN",null,null,null,null,null,null,null,null,null,null,null,null,null,null,null,null,null,"GUATEMALA","GUATEMALA","1DDISDEOCT"]
["1UGUSGUAMO",null,null,null,null,null,null,null,null,null,null,null,null,null,null,null,null,null,"GUATEMALA","GUATEMALA","1DDISDEORN"]
["1GGENHIDRO",null,null,null,null,null,null,null,null,null,null,null,null,null,null,null,null,null,"GUATEMALA","GUATEMALA","1DDISDEORT"]
["1UGUSCPEOE",null,null,null,null,null,null,null,null,null,null,null,null,null,null,null,null,null,"GUATEMALA","GUATEMALA","1DDISEEGTN"]
["1CCOMSOLGU",null,null,null,null,null,null,null,null,null,null,null,null,null,null,null,null,null,"GUATEMALA","GUATEMALA","1DDISEEGTS"]
["1DDISDEORN",null,null,null,null,null,null,null,null,null,null,null,null,null,null,null,null,null,"GUATEMALA","GUATEMALA","1GGDRGEVEL"]
["1DDISEEGTS",null,null,null,null,null,null,null,null,null,null,null,null,null,null,null,null,null,"GUATEMALA","GUATEMALA","1GGDRHIDSD"]
["1GGENBIOEN",null,null,null,null,null,null,null,null,null,null,null,null,null,null,null,null,null,"GUATEMALA","GUATEMALA","1GGDRXOLPR"]
["1GGENINGUN",null,null,null,null,null,null,null,null,null,null,null,null,null,null,null,null,null,"GUATEMALA","GUATEMALA","1GGENALENR"]
["1GGDRGEVEL",null,null,null,null,null,null,null,null,null,null,null,null,null,null,null,null,null,"GUATEMALA","GUATEMALA","1GGENBIOEN"]
["1GGENGRGEO",null,null,null,null,null,null,null,null,null,null,null,null,null,null,null,null,null,"GUATEMALA","GUATEMALA","1GGENCAISA"]
["1CCOMMERGU",null,null,null,null,null,null,null,null,null,null,null,null,null,null,null,null,null,"GUATEMALA","GUATEMALA","1GGENCEAIG"]
["1GGENESIES",null,null,null,null,null,null,null,null,null,null,null,null,null,null,null,null,null,"GUATEMALA","GUATEMALA","1GGENCGESJ"]
["1GGENENSAJ",null,null,null,null,null,null,null,null,null,null,null,null,null,null,null,null,null,"GUATEMALA","GUATEMALA","1GGENCOEGE"]
[null,null,null,null,null,null,null,null,null,null,null,null,null,null,null,null,null,null,"GUATEMALA","GUATEMALA","1GGENCOELL"]
[null,null,null,null,null,null,null,null,null,null,null,null,null,null,null,null,null,null,"GUATEMALA","GUATEMALA","1GGENCONCE"]
[null,null,null,null,null,null,null,null,null,null,null,null,null,null,null,null,null,null,"GUATEMALA","GUATEMALA","1GGENDUEGC"]
[null,null,null,null,null,null,null,null,null,null,null,null,null,null,null,null,null,null,"GUATEMALA","GUATEMALA","1GGENENSAJ"]
[null,null,null,null,null,null,null,null,null,null,null,null,null,null,null,null,null,null,"GUATEMALA","GUATEMALA","1GGENESIES"]
[null,null,null,null,null,null,null,null,null,null,null,null,null,null,null,null,null,null,"GUATEMALA","GUATEMALA","1GGENGEELC"]
[null,null,null,null,null,null,null,null,null,null,null,null,null,null,null,null,null,null,"GUATEMALA","GUATEMALA","1GGENGEELN"]
[null,null,null,null,null,null,null,null,null,null,null,null,null,null,null,null,null,null,"GUATEMALA","GUATEMALA","1GGENGENES"]
[null,null,null,null,null,null,null,null,null,null,null,null,null,null,null,null,null,null,"GUATEMALA","GUATEMALA","1GGENGENMO"]
{"$rows_left_out":44}
{"sheet":"CALCULOS","index":1,"n_rows":27,"n_cols":13,"rows_kept":27,"cut":false,"hidden":true,"merged":[]}
[{"$f":"PROGRAMA!C2","v":"00:00:00"},{"$f":"WEEKDAY(A1,2)","v":6},null,{"$f":"VLOOKUP(PROGRAMA!C2,F4:G20,2,FALSE)","v":"NORMAL"}]
[]
["Hora","Semana","Domingo",null,"id semana","fecha domingo","tipo",null,"hora","max capacity",null,"id dia","dias"]
[2,300,300,null,670,"2015-11-03","FERIADO",null,0,{"$f":"IF(B1=L10,C4,B4)","v":300},{"$f":"IF(D1=\"NORMAL\",J4,C4)","v":300},1,"lunes"]
[3,300,300,null,670,"2015-11-04","FERIADO",null,1,{"$f":"IF(B1=L10,C5,B5)","v":300},{"$f":"IF(D1=\"NORMAL\",J5,C5)","v":300},2,"martes"]
[4,300,300,null,670,"2015-11-05","FERIADO",null,2,{"$f":"IF(B1=L10,C6,B6)","v":300},{"$f":"IF(D1=\"NORMAL\",J6,C6)","v":300},3,"miercoles"]
[5,300,300,null,674,"2015-11-28","FERIADO",null,3,{"$f":"IF(B1=L10,C7,B7)","v":300},{"$f":"IF(D1=\"NORMAL\",J7,C7)","v":300},4,"jueves"]
[6,300,300,null,675,"2015-12-08","FERIADO",null,4,{"$f":"IF(B1=L10,C8,B8)","v":300},{"$f":"IF(D1=\"NORMAL\",J8,C8)","v":300},5,"viernes"]
[7,300,300,null,677,"2015-12-24","FERIADO",null,5,{"$f":"IF(B1=L10,C9,B9)","v":300},{"$f":"IF(D1=\"NORMAL\",J9,C9)","v":300},6,"sabado"]
[8,300,300,null,677,"2015-12-25","FERIADO",null,6,{"$f":"IF(B1=L10,C10,B10)","v":300},{"$f":"IF(D1=\"NORMAL\",J10,C10)","v":300},7,"domingo"]
[9,300,300,null,678,"2015-12-31","FERIADO",null,7,{"$f":"IF(B1=L10,C11,B11)","v":300},{"$f":"IF(D1=\"NORMAL\",J11,C11)","v":300}]
[10,300,300,null,626,"2015-01-01","FERIADO",null,8,{"$f":"IF(B1=L10,C12,B12)","v":300},{"$f":"IF(D1=\"NORMAL\",J12,C12)","v":300}]
[11,300,300,null,627,"2015-01-09","FERIADO",null,9,{"$f":"IF(B1=L10,C13,B13)","v":300},{"$f":"IF(D1=\"NORMAL\",J13,C13)","v":300}]
[12,300,300,null,643,"2015-05-01","FERIADO",null,10,{"$f":"IF(B1=L10,C14,B14)","v":300},{"$f":"IF(D1=\"NORMAL\",J14,C14)","v":300}]
[13,300,300,null,null,null,null,null,11,{"$f":"IF(B1=L10,C15,B15)","v":300},{"$f":"IF(D1=\"NORMAL\",J15,C15)","v":300}]
[14,300,300,null,null,null,null,null,12,{"$f":"IF(B1=L10,C16,B16)","v":300},{"$f":"IF(D1=\"NORMAL\",J16,C16)","v":300}]
[15,300,300,null,null,null,null,null,13,{"$f":"IF(B1=L10,C17,B17)","v":300},{"$f":"IF(D1=\"NORMAL\",J17,C17)","v":300}]
[16,300,300,null,null,null,null,null,14,{"$f":"IF(B1=L10,C18,B18)","v":300},{"$f":"IF(D1=\"NORMAL\",J18,C18)","v":300}]
[17,300,300,null,null,null,null,null,15,{"$f":"IF(B1=L10,C19,B19)","v":300},{"$f":"IF(D1=\"NORMAL\",J19,C19)","v":300}]
[18,300,300,null,"XXX",{"$f":"PROGRAMA!C2","v":"00:00:00"},"NORMAL",null,16,{"$f":"IF(B1=L10,C20,B20)","v":300},{"$f":"IF(D1=\"NORMAL\",J20,C20)","v":300}]
[19,300,300,null,null,null,null,null,17,{"$f":"IF(B1=L10,C21,B21)","v":300},{"$f":"IF(D1=\"NORMAL\",J21,C21)","v":300}]
[20,300,300,null,null,null,null,null,18,{"$f":"IF(B1=L10,C22,B22)","v":300},{"$f":"IF(D1=\"NORMAL\",J22,C22)","v":300}]
[21,300,300,null,null,null,null,null,19,{"$f":"IF(B1=L10,C23,B23)","v":300},{"$f":"IF(D1=\"NORMAL\",J23,C23)","v":300}]
[22,300,300,null,null,null,null,null,20,{"$f":"IF(B1=L10,C24,B24)","v":300},{"$f":"IF(D1=\"NORMAL\",J24,C24)","v":300}]
[23,300,300,null,null,null,null,null,21,{"$f":"IF(B1=L10,C25,B25)","v":300},{"$f":"IF(D1=\"NORMAL\",J25,C25)","v":300}]
[24,300,300,null,null,null,null,null,22,{"$f":"IF(B1=L10,C26,B26)","v":300},{"$f":"IF(D1=\"NORMAL\",J26,C26)","v":300}]
[1,300,300,null,null,null,null,null,23,{"$f":"IF(B1=L10,C27,B27)","v":300},{"$f":"IF(D1=\"NORMAL\",J27,C27)","v":300}]